{"text_format":"1","workbook":"xlsx","n_sheets":4,"sheets":["Параметры","Кмп","Поправочные коэффициенты","Расчет"],"not_rendered":{"charts":0,"images":1,"macros":1,"external_links":0,"defined_names":2,"comments":0,"pivot_tables":0},"unopened":[],"bounds":{"document_bytes":16777216,"sheet_cells":100000,"rows_first":2000,"rows_last":500,"rows_between":2000,"halvings":0,"cell_chars":16384,"cell_head_chars":4096},"cells_cut":0,"cells_raw":0,"read":"whole","date_system":"1900"}

{"sheet":"Параметры","index":0,"n_rows":46,"n_cols":12,"rows_kept":46,"cut":false,"hidden":true,"merged":[]}
["№ п/п","Код","Вид использования земельного участка краткий","Базовая ставка, руб./кв. м","коэфф_функции","функция","а - показатель диапазона изменения к-та площади","So - Средний размер ЗУ, кв.м","n - показатель крутизны нелинейности","Вид использования земельного участка","Номер ФИ по постановлению","группа ФИ"]
[1,"F1_1","Многоквартирная жилая застройка",11,1,"F1",1.04,4100,1,"Многоквартирная жилая застройка","1.1","Жилая"]
[2,"F1_2","ИЖС, дачи, садоводства",122,1,"F1",1.04,4100,1,"Индивидуальная жилая застройка, дачи, садоводства","1.2","Жилая"]
[3,"F1_3","ИЖС (площадь участка более 0,5 га)",35,1,"F1",1.04,4100,1,"Индивидуальная жилая застройка (площадь участка более 0,5 га)","1.3","Жилая"]
[4,"F2_1","Индивидуальные гаражи для хранения личного автотранспорта",101,1,"F2",1.08,4100,1,"Объекты для хранения индивидуального личного транспорта (кроме мест хранения, расположенных на земельных участках, предоставленных гаражным кооперативам)","2.1","Гаражная"]
[5,"F2_2","Гаражные кооперативы",14,1,"F2",1.08,4100,1,"Гаражные кооперативы","2.2","Гаражная"]
[6,"F2_3","Коммерческие автостоянки",129,1,"F2",1.08,4100,1,"Коммерческие автостоянки","2.3","Гаражная"]
[7,"F2_4","Гостевые автостоянки, паркинги",108,1,"F2",1.08,4100,1,"Гостевые автостоянки, паркинги","2.4","Гаражная"]
[8,"F3_1","Бизнес-центры, банки",355,1,"F3",1.34,6400,1,"Объекты финансовой, кредитной, страховой, юридической деятельности, бизнес-центры","3.1","Офисная"]
[9,"F3_2","Административно-управленческая деятельность",234,1,"F3",1.34,6400,1,"Объекты административно-управленческого назначения","3.2","Офисная"]
[10,"F3_3","Объекты адм. назначения общественных организаций",102,1,"F3",1.34,6400,1,"Объекты административного назначения общественных организаций","3.3","Офисная"]
[11,"F3_4","Прочие объекты административно-хозяйственного назначения",242,1,"F3",1.34,6400,1,"Прочие объекты административно-хозяйственного назначения","3.4","Офисная"]
[12,"F4_1","Объекты пищевой промышленности",239,1,"F4",1.21,7800,1,"Объекты пищевой промышленности","4.1","Производственно-складская"]
[13,"F4_2","Объекты рыбодобывающей и рыбоперерабатывающей промышленности ",229,1,"F4",1.21,7800,1,"Объекты рыбодобывающей и рыбоперерабатывающей промышленности ","4.2","Производственно-складская"]
[14,"F4_3","Объекты судоремонтной промышленности",220,1,"F4",1.21,7800,1,"Объекты судоремонтной промышленности","4.3","Производственно-складская"]
[15,"F4_4","Объекты металлообрабатывающей промышленности",571,1,"F4",1.21,7800,1,"Объекты металлообрабатывающей промышленности","4.4","Производственно-складская"]
[16,"F4_5","Объекты нефте-газовой промышленности",413,1,"F4",1.21,7800,1,"Объекты нефте-газовой промышленности, за исключением линейных объектов","4.5","Производственно-складская"]
[17,"F4_6","Электростанции, ТП и прочие объекты энергетики ",120,1,"F4",1.21,7800,1,"Электростанции, трансформаторные подстанции и прочие объекты энергетики ","4.6","Производственно-складская"]
[18,"F4_7","Объекты железнодорожного транспорта",187,1,"F4",1.21,7800,1,"Объекты железнодорожного транспорта","4.7","Производственно-складская"]
[19,"F4_8","Объекты автомобильного транспорта",79,1,"F4",1.21,7800,1,"Объекты автомобильного транспорта, в том числе элементы благоустройства территории транспортных коммуникаций","4.8","Производственно-складская"]
[20,"F4_9","Объекты водного транспорта",192,1,"F4",1.21,7800,1,"Объекты водного транспорта","4.9","Производственно-складская"]
[21,"F4_10","Склады и складские базы производственного назначения",190,1,"F4",1.21,7800,1,"Склады и складские базы производственного назначения","4.10","Производственно-складская"]
[22,"F4_11","Информация и связь",63,1,"F4",1.21,7800,1,"Объекты связи, радиовещания, телевидения и информатики","4.11","Производственно-складская"]
[23,"F4_12","Информация и связь (государственное вещание, интересы обороны РФ)",56,1,"F4",1.21,7800,1,"Объекты связи, радиовещания, телевидения и информатики, обеспечивающих производство и распространение  (трансляцию) государственных программ телевидения и  радиовещания, а также осуществляющих деятельность в интересах обороны Российской Федерации","4.12","Производственно-складская"]
[24,"F4_13","Производство, хранение и переработка с/х продукции",0.2,1,"F4",1.21,7800,1,"Объекты для производства, хранения и переработки сельскохозяйственной продукции. Земельные участки, предоставленные для личного подсобного хозяйства, огородничества, животноводства, крестьянские (фермерские) хозяйства","4.13","Производственно-складская"]
[25,"F4_14","Объекты инженерно-коммунальной инфраструктуры ",34,1,"F4",1.21,7800,1,"Объекты инженерно-коммунальной инфраструктуры","4.14","Производственно-складская"]
[26,"F4_15","Хранение и обслуживание автотранспорта юридических лиц ",91,1,"F4",1.21,7800,1,"Объекты для хранения и обслуживания собственного автотранспорта юридических лиц","4.15","Производственно-складская"]
[27,"F4_16","Прочие промышленные предприятия и объекты",215,1,"F4",1.21,7800,1,"Прочие промышленные предприятия и объекты","4.16","Производственно-складская"]
[28,"F5_1","Магазины",429,1,"F5",1.1499999999999999,1600,1,"Магазины","5.1","Торговая"]
[29,"F5_2","Оптовые склады-магазины",662,1,"F5",1.1499999999999999,1600,1,"Оптовые склады-магазины","5.2","Торговая"]
[30,"F5_3","Рынки и открытые торговые площадки",489,1,"F5",1.1499999999999999,1600,1,"Рынки и открытые торговые площадки","5.3","Торговая"]
[31,"F5_4","Многофункциональные торгово-развлекательные комплексы",531,1,"F5",1.1499999999999999,1600,1,"Многофункциональные торговые и торгово-развлекательные комплексы","5.4","Торговая"]
[32,"F5_5","Торговые павильоны, киоски",1894,1,"F5",1.1499999999999999,1600,1,"Торговые павильоны, киоски","5.5","Торговая"]
[33,"F5_6","Мойки, станции технического обслуживания автотранспорта, шиномонтажные мастерские",390,1,"F5",1.1499999999999999,1600,1,"Мойки, станции технического обслуживания автотранспорта, в том числе шиномонтажные мастерские","5.6","Торговая"]
[34,"F5_7","Объекты общественного питания",433,1,"F5",1.1499999999999999,1600,1,"Объекты общественного питания","5.7","Торговая"]
[35,"F5_8","Объекты бытового обслуживания",275,1,"F5",1.1499999999999999,1600,1,"Объекты бытового обслуживания","5.8","Торговая"]
[36,"F5_9","Гостиницы, кемпинги",517,1,"F5",1.1499999999999999,1600,1,"Гостиницы, кемпинги","5.9","Торговая"]
[37,"F5_10","Объекты развлекательного характера",914,1,"F5",1.1499999999999999,1600,1,"Объекты развлекательного характера, тематические парки, парки аттракционов","5.10","Торговая"]
[38,"F5_11","Рекламные конструкции, сооружения",1070,1,"F5",1.1499999999999999,1600,1,"Рекламные конструкции, сооружения","5.11","Торговая"]
[39,"F5_12","АЗС, в том числе топливные хранилища",532,1,"F5",1.1499999999999999,1600,1,"Автозаправочные станции, газо-автозаправочные станции, газонаполнительные станции, в том числе топливные хранилища","5.12","Торговая"]
[40,"F6_1","Объекты отдыха и туризма ",18,1,"F6",1.04,27000,1,"Объекты отдыха и туризма ","6.1","Социально-рекреационная"]
[41,"F6_2","Особо охраняемые территории и объекты",6,1,"F6",1.04,27000,1,"Особо охраняемые территории и объекты","6.2","Социально-рекреационная"]
[42,"F6_3","Объекты образования, науки, культуры, физкультуры и спорта",88,1,"F6",1.04,27000,1,"Объекты образования, науки, здравоохранения, социального обеспечения, ветеринарной службы, физкультуры и спорта, культуры и искусства","6.3","Социально-рекреационная"]
[43,"F6_4","Благоустройство территории",14,1,"F6",1.04,27000,1,"Благоустройство территории","6.4","Социально-рекреационная"]
[44,"F7_1","Линейные объекты",34,1,"F7",1,1,1,"Линии электропередач, водопроводные, канализационные, тепловые сети, газопроводы, подъездные автомобильные и железнодорожные пути","7.1","Линейные объекты"]
[45,"F8_1","Изыскательские работы",88,1,"F8",1,1,1,"Земельные участки, предоставленные в аренду для выполнения изыскательских работ","7.2","Земельные участки, предоставленные в аренду для выполнения изыскательских работ"]

{"sheet":"Кмп","index":1,"n_rows":151,"n_cols":9,"rows_kept":151,"cut":false,"hidden":true,"merged":[]}
["KAD_NOM","F1","F2","F3","F4","F5","F6","F7","F8"]
["51:20:0001007",0.73,0.83899999999999997,0.68500000000000005,0.66400000000000003,0.77300000000000002,0.77900000000000003,1,1]
["51:20:0001008",0.95499999999999996,0.998,0.77,1.07,1.1020000000000001,1.371,1,1]
["51:20:0001009",0.75,0.83299999999999996,0.77,0.63300000000000001,0.9,0.79500000000000004,1,1]
["51:20:0001010",0.93700000000000006,0.98499999999999999,0.87,0.84299999999999997,1.0580000000000001,0.996,1,1]
["51:20:0001011",0.98599999999999999,0.96899999999999997,0.84899999999999998,1.0880000000000001,1.0549999999999999,1.2150000000000001,1,1]
["51:20:0001012",0.77200000000000002,0.878,0.8,0.54900000000000004,1.044,0.69599999999999995,1,1]
["51:20:0001017",0.39400000000000002,0.88900000000000001,0.6,0.7,0.88500000000000001,0.377,1,1]
["51:20:0001018",0.54300000000000004,0.83299999999999996,0.7,0.65400000000000003,0.63200000000000001,0.51800000000000002,1,1]
["51:20:0001019",0.252,0.26900000000000002,0.23599999999999999,0.505,0.67400000000000004,0.222,1,1]
["51:20:0001054",0.54500000000000004,0.91100000000000003,1.0900000000000001,0.89,0.72899999999999998,0.56000000000000005,1,1]
["51:20:0001055",0.81899999999999995,0.91100000000000003,0.89,0.7,0.92500000000000004,0.80600000000000005,1,1]
["51:20:0001100",0.48699999999999999,0.57799999999999996,0.45600000000000002,0.34499999999999997,0.433,0.499,1,1]
["51:20:0001140",1.194,1.022,1.083,1.302,1.1279999999999999,1.4019999999999999,1,1]
["51:20:0001141",1.3149999999999999,1.5680000000000001,1.171,1.484,1.115,1.5449999999999999,1,1]
["51:20:0001142",1.3779999999999999,1.4770000000000001,1.171,1.3220000000000001,1.115,1.5249999999999999,1,1]
["51:20:0001143",0.93100000000000005,0.88500000000000001,1.1120000000000001,0.87,1.224,0.96499999999999997,1,1]
["51:20:0001144",0.73199999999999998,1.03,0.91100000000000003,0.9,0.98299999999999998,0.70899999999999996,1,1]
["51:20:0001145",1.23,1.351,1.1120000000000001,1.216,1.1120000000000001,1.2430000000000001,1,1]
["51:20:0001146",1.262,1.4370000000000001,1.139,1.274,1.1120000000000001,1.31,1,1]
["51:20:0001147",1.2909999999999999,1.4710000000000001,1.1639999999999999,1.4179999999999999,1.101,1.5,1,1]
["51:20:0001148",1.169,1.1870000000000001,1.145,1.0960000000000001,1.1040000000000001,1.2,1,1]
["51:20:0001149",0.27600000000000002,0.91500000000000004,0.89,0.73,0.9,0.47099999999999997,1,1]
["51:20:0001150",0.91400000000000003,1.415,0.95199999999999996,0.89500000000000002,0.96499999999999997,1.0629999999999999,1,1]
["51:20:0001151",1.1779999999999999,1.4059999999999999,1.1140000000000001,1.2250000000000001,1.1000000000000001,1.3540000000000001,1,1]
["51:20:0001152",1.321,1.4279999999999999,1.2170000000000001,1.41,1.1000000000000001,1.546,1,1]
["51:20:0001153",1.0780000000000001,1.0069999999999999,0.92300000000000004,0.85,0.871,1.135,1,1]
["51:20:0001154",0.15,0.98799999999999999,0.69399999999999995,0.66900000000000004,0.77300000000000002,0.70099999999999996,1,1]
["51:20:0001155",0.498,0.90300000000000002,0.75,0.751,0.755,0.49,1,1]
["51:20:0001300",0.22800000000000001,0.23,0.7,0.55000000000000004,0.154,0.20499999999999999,1,1]
["51:20:0001301",0.80600000000000005,0.72,0.74099999999999999,0.65900000000000003,0.76900000000000002,0.98,1,1]
["51:20:0001302",0.97199999999999998,0.96499999999999997,0.91100000000000003,0.95699999999999996,0.84,1.105,1,1]
["51:20:0001303",0.751,0.68700000000000006,0.60399999999999998,0.60799999999999998,0.59799999999999998,0.80700000000000005,1,1]
["51:20:0001304",0.86499999999999999,1.0069999999999999,0.7,0.76500000000000001,0.74299999999999999,0.96,1,1]
["51:20:0001305",0.71599999999999997,0.92,0.753,0.69499999999999995,0.82,1.1060000000000001,1,1]
["51:20:0001306",1.1319999999999999,0.94199999999999995,0.91100000000000003,0.68,0.83,1.472,1,1]
["51:20:0001307",0.70099999999999996,0.67700000000000005,0.63300000000000001,0.58399999999999996,0.59699999999999998,0.77700000000000002,1,1]
["51:20:0001308",0.626,0.65600000000000003,0.56999999999999995,0.5,0.54100000000000004,0.48299999999999998,1,1]
["51:20:0001309",0.90200000000000002,1.0109999999999999,0.84499999999999997,0.77600000000000002,0.70799999999999996,1.1539999999999999,1,1]
["51:20:0001310",0.80400000000000005,0.96699999999999997,0.72099999999999997,0.71899999999999997,0.52500000000000002,1.143,1,1]
["51:20:0001311",0.61499999999999999,0.58699999999999997,0.627,0.61,0.54500000000000004,0.751,1,1]
["51:20:0001312",0.67400000000000004,0.56899999999999995,0.56399999999999995,0.69599999999999995,0.45900000000000002,0.96499999999999997,1,1]
["51:20:0001313",0.81299999999999994,0.92900000000000005,0.71199999999999997,0.59299999999999997,0.52500000000000002,0.96599999999999997,1,1]
["51:20:0001314",0.45100000000000001,0.61799999999999999,0.45200000000000001,0.5,0.52200000000000002,0.48899999999999999,1,1]
["51:20:0001315",0.52400000000000002,0.61,0.57199999999999995,0.41399999999999998,0.56699999999999995,0.60399999999999998,1,1]
["51:20:0001316",4.4999999999999998E-2,0.56000000000000005,0.437,0.48299999999999998,0.433,0.56299999999999994,1,1]
["51:20:0001317",0.219,0.34399999999999997,0.33200000000000002,0.23599999999999999,0.44900000000000001,0.32700000000000001,1,1]
["51:20:0001318",0.57999999999999996,0.73,0.73,0.48199999999999998,0.41799999999999998,0.622,1,1]
["51:20:0001319",0.87,1.0940000000000001,0.77,0.71399999999999997,0.77300000000000002,0.81,1,1]
["51:20:0001320",1.091,1.05,0.71099999999999997,1.2190000000000001,0.70099999999999996,1.335,1,1]
["51:20:0001601",0.435,0.434,0.49199999999999999,0.59299999999999997,0.40200000000000002,0.308,1,1]
["51:20:0001602",0.27800000000000002,0.47399999999999998,0.27,0.57299999999999995,0.48,0.29599999999999999,1,1]
["51:20:0001603",0.222,0.71399999999999997,0.44800000000000001,0.76300000000000001,0.40600000000000003,0.29099999999999998,1,1]
["51:20:0001604",0.16700000000000001,0.51600000000000001,0.41199999999999998,0.51800000000000002,0.47199999999999998,0.19500000000000001,1,1]
["51:20:0001605",0.16400000000000001,0.1,0.41199999999999998,0.27600000000000002,0.47199999999999998,0.20599999999999999,1,1]
["51:20:0001606",0.126,0.111,0.11899999999999999,0.55100000000000005,7.9000000000000001E-2,0.14599999999999999,1,1]
["51:20:0001607",0.51400000000000001,0.38500000000000001,0.41199999999999998,0.77,0.47199999999999998,0.26400000000000001,1,1]
["51:20:0001608",0.1,0.47399999999999998,0.46600000000000003,0.61199999999999999,0.48,0.42799999999999999,1,1]
["51:20:0002013",0.71199999999999997,0.94599999999999995,0.84299999999999997,0.65300000000000002,0.81899999999999995,0.69199999999999995,1,1]
["51:20:0002014",1.119,1.1000000000000001,0.96,1.07,1.198,1.212,1,1]
{"$rows_left_out":92}
{"sheet":"Поправочные коэффициенты","index":2,"n_rows":27,"n_cols":4,"rows_kept":27,"cut":false,"hidden":true,"merged":[]}
["Регулирующие коэффициенты"]
["Код","Значение","Краткое название","Примечание"]
["КР0",1,"нет"]
["КР1",0.5,"Строительство (норм. срок)","Земельные участки для строительства объектов (за исключением жилищного), реконструкции, восстановления разрушенных объектов, для проведения проектно-изыскательских работ, выполнения благоустройства территории сроком не более трех лет, на период установленного нормативного срока строительства, восстановления разрушенных объектов"]
["КР2",2,"1 год превышения норм. срока","Земельные участки для строительства объектов (за исключением жилищного), реконструкции, восстановления разрушенных объектов на период установленного нормативного срока строительства, реконструкции, восстановления разрушенных объектов, на первый год превышения"]
["КР3",3,"2 год превышения норм. срока","Земельные участки для строительства объектов (за исключением жилищного), реконструкции, восстановления разрушенных объектов на период установленного нормативного срока строительства, реконструкции, восстановления разрушенных объектов, на второй год превышения"]
["КР4",4,"3 год превышения норм. срока","Земельные участки для строительства объектов (за исключением жилищного), реконструкции, восстановления разрушенных объектов на период установленного нормативного срока строительства, реконструкции, восстановления разрушенных объектов, на третий год превышения"]
["КР5",0.7,"Проектные работы","Для проведения проектных работ"]
["КР6",2,"Несовпадение функц.использования","Использование объекта не в соответствии с функциональным назначением объекта, указанным в правоустанавливающих документах на объект"]
["КР7",1E-3,"Коэффициент для резидентов Арктической зоны","Коэффициент для резидентов Арктической зоны"]
["Коэффициенты общественной значимости"]
["Код","Значение","Краткое название","Примечание"]
["КО0",1,"нет"]
["КО1",1.2999999999999999E-3,"Общего пользования и концессии (до 1500 кв.м)","Земельные участки, предоставленные для содержания и использования по назначению земель общего пользования и предоставленные на основании концессионных соглашений площадью до 1500 кв.м "]
["КО2",6.9999999999999999E-4,"Общего пользования и концесс. (от 1500 до 5000 кв.м)","Земельные участки, предоставленные для содержания и использования по назначению земель общего пользования и предоставленные на основании концессионных соглашений площадью от 1500 кв.м до 5000 кв.м"]
["КО3",1.2999999999999999E-4,"Общего пользования и концессии  (более 5000 кв.м)","Земельные участки, предоставленные для содержания и использования по назначению земель общего пользования и предоставленные на основании концессионных соглашений площадью более 5000 кв.м"]
["КО4",0.01,"мобилизационного назначения","Земельные участки под объектами мобилизационного назначения, мобилизационными мощностями, законсервированными и не используемыми в текущем производстве, испытательными полигонами и складами для хранения мобилизационного резерва и мобилизационных запасов"]
["КО5",5.0000000000000001E-3,"Строительство за счет бюджета","Земельные участки для строительства объектов за счет бюджетов  на период установленного нормативного срока строительства      "]
["КО6",0.1,"Спортивные объекты","Земельные участки под открытыми спортивными и спортивно-оздоровительными объектами (стадионы, комплексы горнолыжные, комплексы лыжные, сноуборд-парки - фристайл-центры, стрельбища, тиры стрелковые, трассы спортивные, площадки спортивные, парки для экстремальных видов спорта, спортивно-оздоровительные комплексы и другие)"]
["Социальные коэффициенты"]
["Код","Значение","Краткое название","Примечание"]
["КС0",1,"нет"]
["КС1",0.01,"ФЛ для предпринимательской деятельности (п.5 ст. 391 НК)","Земельные участки, предоставленные гражданам, на которых распространяется действие пункта 5 статьи 391 Налогового кодекса РФ (по одному земельному участку по выбору гражданина для предпринимательской деятельности)"]
["КС2",1E-3,"ФЛ для некоммерческой деятельности (п.5 ст. 391 НК)","Земельные участки, предоставленные физическим лицам, перечисленным в пункте 5 статьи 391 Налогового кодекса Российской Федерации, в статье 2 Закона Мурманской области от 23.12.2004 № 550-01-ЗМО «О мерах социальной поддержки отдельных категорий граждан», использующим объекты, расположенные на арендуемых земельных участках, и земельные участки в некоммерческих целях"]
["КС3",1E-3,"организациям инвалидов (не менее 80%)","Земельные участки, предоставленные общественным организациям инвалидов, среди членов которых инвалиды и их законные представители составляют не менее 80 процентов, - в отношении земельных участков, используемых ими для осуществления уставной деятельности;"]
["КС4",1E-3,"организациям инвалидов (не менее 50%)","Земельные участки, предоставленные организациям, уставный капитал которых полностью состоит из вкладов выше указанных организаций инвалидов, если среднесписочная численность инвалидов среди их работников составляет не менее 50 процентов, а их доля в фонде оплаты труда - не менее 25 процентов, - в отношении земельных участков, используемых ими для производства и (или) реализации товаров, работ и услуг;"]
["КС5",1E-3,"учрежд. образования и культуры (организации инвалидов) ","Земельные участки, предоставленные учреждениям, единственными собственниками которых являются вышеуказанные общественные организации инвалидов, - в отношении земельных участков, используемых ими для достижения образовательных, культурных, лечебно-оздоровительных, физкультурно-спортивных, научных, информационных и иных целей социальной защиты и реабилитации инвалидов, а также для оказания правовой и иной помощи инвалидам, детям-инвалидам и их родителям"]

{"sheet":"Расчет","index":3,"n_rows":36,"n_cols":6,"rows_kept":36,"cut":false,"hidden":false,"merged":[[3,2,3,3]]}
[]
[null,null,"Расчет величины арендной платы с 01.01.2024 г."]
[null,null,"в соответствии с решением Совета депутатов города Мурманска от 27.11.2014 №3-41"]
[null,null,"\"Об утверждении Методики определения размера арендной платы за пользование земельными участками, находящимися в муниципальной собственности муниципального образования город Мурманск\""]
[]
[null,null,"Площадь земельного участка, кв.м",100]
[null,null,"Кадастровый квартал",null,104,{"$f":"INDEX(Кмп!A2:A151,Расчет!E7,1)","v":"51:20:0003006"}]
[null,null,"Вид функционального использования (ФИ) объекта",null,5]
[null,null,"Регулирующий коэффициент",null,1]
[null,null,"Коэффициент общественной значимости",null,1]
[null,null,"Коэффициент социальной поддержки",null,1]
[null,null,"Арендный платеж, руб. в год",{"$f":"D6*D19*D27*D20*D32*D22*D23*D24*D25","v":739.51191757039794}]
[]
[null,null,"Справочно:"]
[null,null,"Формула для расчета","АП = Пзу * Аб * Кмп * Кпл * Кр * Коз * Ксп * Кд"]
[null,null,"Полное название вида ФИ",{"$f":"INDEX(Параметры!A2:J46,MATCH(Расчет!E8,Параметры!A2:A46,0),10)","v":"Гаражные кооперативы"}]
[null,null,"Код вида ФИ",{"$f":"INDEX(Параметры!A2:L46,MATCH(Расчет!E8,Параметры!A2:A46,0),11)","v":"2.2"},{"$f":"INDEX(Параметры!A2:I46,MATCH(Расчет!E8,Параметры!A2:A46,0),2)","v":"F2_2"}]
[null,null,"Группа вида ФИ",{"$f":"INDEX(Параметры!A2:L46,MATCH(Расчет!E8,Параметры!A2:A46,0),12)","v":"Гаражная"},{"$f":"IF(E20=\"F1\",2,IF(E20=\"F2\",3,IF(E20=\"F3\",4,IF(E20=\"F4\",5,IF(E20=\"F5\",6,IF(E20=\"F6\",7,IF(E20=\"F7\",8,9)))))))","v":3}]
[null,null,"Базовая ставка, руб. (Аб)",{"$f":"INDEX(Параметры!D2:D46,Расчет!E8,0)","v":14}]
[null,null,"Коэффициент местоположения (Кмп)",{"$f":"INDEX(Кмп!A2:I151,MATCH(Расчет!F7,Кмп!A2:A151,0),(MATCH(E20,Кмп!A1:I1,0)))","v":0.79500000000000004},{"$f":"LEFT(E17,2)","v":"F2"}]
[null,null,"Коэффициент площади (Кпл)",{"$f":"ROUND(D32,3)","v":1.0760000000000001}]
[null,null,"Регулирующий коэффициент (Кр)",{"$f":"INDEX('Поправочные коэффициенты'!A3:C10,E9,2)","v":1}]
[null,null,"Коэффициент общественной значимости (Коз)",{"$f":"INDEX('Поправочные коэффициенты'!A13:C19,E10,2)","v":1}]
[null,null,"Коэффициент социальной поддержки (Ксп)",{"$f":"INDEX('Поправочные коэффициенты'!A22:C27,E11,2)","v":1}]
[null,null,"Коэффициент динамики рынка (Кд)",1.2350000000000001]
[null,null,"Годовой размер арендной платы за пользование земельным участком, руб.",{"$f":"D6*D19*D20*D32*D22*D23*D24*D25","v":1479.0238351407959}]
[null,null,"Мультипликатор (множитель) на 2016 г. (согласно       п. 12 решения Совета депутатов города Мурманска от 27.11.2014 №3-41)",0.5]
[]
[null,null,"Расчет коэффициента площади"]
[]
[null,null,"где:"]
[null,null,"Кпл – коэффициент площади;",{"$f":"D33^(2*EXP(-(D34/D35)^D36)-1)","v":1.0760019316366356}]
[null,null,"а – показатель диапазона изменения коэффициента площади;",{"$f":"INDEX(Параметры!G2:I46,Расчет!E8,1)","v":1.08}]
[null,null,"s – площадь Объекта аренды;",{"$f":"D6","v":100}]
[null,null,"S0 – параметр коэффициента площади; размер участка, при котором Кпл равен 1;",{"$f":"INDEX(Параметры!G2:I46,Расчет!E8,2)","v":4100}]
[null,null,"n – показатель нелинейности.",{"$f":"INDEX(Параметры!G2:I46,Расчет!E8,3)","v":1}]